Reaction Details
TargetSodium-dependent serotonin transporter
LigandBDBM50310651
Substrate/Competitorn/a
Meas. Tech.ChEMBL_620406 (CHEMBL1112301)
Ki 11±n/a nM
Citation Wakenhut, FAllan, GAFish, PVFray, MJHarrison, ACMcCoy, RPhillips, SCRyckmans, TStobie, AWestbrook, DWestbrook, SLWhitlock, GA N-[(3S)-Pyrrolidin-3-yl]benzamides as novel dual serotonin and noradrenaline reuptake inhibitors: impact of small structural modifications on P-gp recognition and CNS penetration. Bioorg Med Chem Lett19:5078-81 (2009) 
 
Sodium-dependent serotonin transporter
Name:Sodium-dependent serotonin transporter
Type:Multi-pass membrane protein
Mol. Mass.:70322.51
Organism:Homo sapiens (Human)
Description:P31645
Residue:630
BDBM50310651
NameBDBM50310651
Synonyms:(S)-2-chloro-N-isobutyl-N-(pyrrolidin-3-yl)-3-(trifluoromethyl)benzamide | CHEMBL1077638
TypeSmall organic molecule
Emp. Form.C16H20ClF3N2O
Mol. Mass.348.791
SMILESCC(C)CN([C@H]1CCNC1)C(=O)c1cccc(c1Cl)C(F)(F)F