Reaction Details
TargetSodium-dependent noradrenaline transporter
LigandBDBM50310657
Substrate/Competitorn/a
Meas. Tech.ChEMBL_620407 (CHEMBL1112302)
Ki 217±n/a nM
Citation Wakenhut, FAllan, GAFish, PVFray, MJHarrison, ACMcCoy, RPhillips, SCRyckmans, TStobie, AWestbrook, DWestbrook, SLWhitlock, GA N-[(3S)-Pyrrolidin-3-yl]benzamides as novel dual serotonin and noradrenaline reuptake inhibitors: impact of small structural modifications on P-gp recognition and CNS penetration. Bioorg Med Chem Lett19:5078-81 (2009) 
 
Sodium-dependent noradrenaline transporter
Name:Sodium-dependent noradrenaline transporter
Type:Multi-pass membrane protein
Mol. Mass.:69337.72
Organism:Homo sapiens (Human)
Description:P23975
Residue:617
BDBM50310657
NameBDBM50310657
Synonyms:(S)-2,3-dichloro-N-ethyl-N-(pyrrolidin-3-yl)benzamide | CHEMBL1078312
TypeSmall organic molecule
Emp. Form.C13H16Cl2N2O
Mol. Mass.287.185
SMILESCCN([C@H]1CCNC1)C(=O)c1cccc(Cl)c1Cl