Reaction Details
TargetSodium-dependent noradrenaline transporter
LigandBDBM50310647
Substrate/Competitorn/a
Meas. Tech.ChEMBL_620407 (CHEMBL1112302)
Ki 11±n/a nM
Citation Wakenhut, FAllan, GAFish, PVFray, MJHarrison, ACMcCoy, RPhillips, SCRyckmans, TStobie, AWestbrook, DWestbrook, SLWhitlock, GA N-[(3S)-Pyrrolidin-3-yl]benzamides as novel dual serotonin and noradrenaline reuptake inhibitors: impact of small structural modifications on P-gp recognition and CNS penetration. Bioorg Med Chem Lett19:5078-81 (2009) 
 
Sodium-dependent noradrenaline transporter
Name:Sodium-dependent noradrenaline transporter
Type:Multi-pass membrane protein
Mol. Mass.:69337.72
Organism:Homo sapiens (Human)
Description:P23975
Residue:617
BDBM50310647
NameBDBM50310647
Synonyms:(S)-2,3-dichloro-N-phenyl-N-(pyrrolidin-3-yl)benzamide | CHEMBL1079264
TypeSmall organic molecule
Emp. Form.C17H16Cl2N2O
Mol. Mass.335.228
SMILESClc1cccc(C(=O)N([C@H]2CCNC2)c2ccccc2)c1Cl