Reaction Details
TargetSodium-dependent dopamine transporter
LigandBDBM50310659
Substrate/Competitorn/a
Meas. Tech.ChEMBL_620408 (CHEMBL1112303)
Ki 3730±n/a nM
Citation Wakenhut, FAllan, GAFish, PVFray, MJHarrison, ACMcCoy, RPhillips, SCRyckmans, TStobie, AWestbrook, DWestbrook, SLWhitlock, GA N-[(3S)-Pyrrolidin-3-yl]benzamides as novel dual serotonin and noradrenaline reuptake inhibitors: impact of small structural modifications on P-gp recognition and CNS penetration. Bioorg Med Chem Lett19:5078-81 (2009) 
 
Sodium-dependent dopamine transporter
Name:Sodium-dependent dopamine transporter
Type:Multi-pass membrane protein
Mol. Mass.:68497.11
Organism:Homo sapiens (Human)
Description:Q01959
Residue:620
BDBM50310659
NameBDBM50310659
Synonyms:(S)-2,3-dichloro-N-(pyrrolidin-3-yl)-N-(2,2,2-trifluoroethyl)benzamide | CHEMBL1080788
TypeSmall organic molecule
Emp. Form.C13H13Cl2F3N2O
Mol. Mass.341.156
SMILESFC(F)(F)CN([C@H]1CCNC1)C(=O)c1cccc(Cl)c1Cl