Reaction Details
TargetSodium-dependent dopamine transporter
LigandBDBM50310650
Substrate/Competitorn/a
Meas. Tech.ChEMBL_620408 (CHEMBL1112303)
Ki 430±n/a nM
Citation Wakenhut, FAllan, GAFish, PVFray, MJHarrison, ACMcCoy, RPhillips, SCRyckmans, TStobie, AWestbrook, DWestbrook, SLWhitlock, GA N-[(3S)-Pyrrolidin-3-yl]benzamides as novel dual serotonin and noradrenaline reuptake inhibitors: impact of small structural modifications on P-gp recognition and CNS penetration. Bioorg Med Chem Lett19:5078-81 (2009) 
 
Sodium-dependent dopamine transporter
Name:Sodium-dependent dopamine transporter
Type:Multi-pass membrane protein
Mol. Mass.:68497.11
Organism:Homo sapiens (Human)
Description:Q01959
Residue:620
BDBM50310650
NameBDBM50310650
Synonyms:(S)-3,4-dichloro-N-isobutyl-N-(pyrrolidin-3-yl)benzamide | CHEMBL1078742
TypeSmall organic molecule
Emp. Form.C15H20Cl2N2O
Mol. Mass.315.238
SMILESCC(C)CN([C@H]1CCNC1)C(=O)c1ccc(Cl)c(Cl)c1