Reaction Details
TargetCytochrome P450 3A4
LigandBDBM50310823
Substrate/Competitorn/a
Meas. Tech.ChEMBL_621523 (CHEMBL1108441)
IC50 2420±n/a nM
Citation César, TBManthey, JAMyung, K Minor furanocoumarins and coumarins in grapefruit peel oil as inhibitors of human cytochrome P450 3A4. J Nat Prod72:1702-4 (2009) 
 
Cytochrome P450 3A4
Name:Cytochrome P450 3A4
Type:Enzyme
Mol. Mass.:57349.57
Organism:Homo sapiens (Human)
Description:n/a
Residue:503
BDBM50310823
NameBDBM50310823
Synonyms:CHEMBL1078442 | bergamottin
TypeSmall organic molecule
Emp. Form.C21H22O4
Mol. Mass.338.397
SMILES[#6]\[#6](-[#6])=[#6]\[#6]-[#6]\[#6](-[#6])=[#6]\[#6]-[#8]-c1c2ccoc2cc2oc(=O)ccc12