Reaction Details
TargetTelomerase reverse transcriptase
LigandBDBM50134002
Substrate/Competitorn/a
Meas. Tech.ChEMBL_622825 (CHEMBL1105835)
IC50 50±n/a nM
Citation Castillo-González, DCabrera-Pérez, MAPérez-González, MMorales Helguera, ADurán-Martínez, A Prediction of telomerase inhibitory activity for acridinic derivatives based on chemical structure. Eur J Med Chem44:4826-40 (2009) 
 
Telomerase reverse transcriptase
Name:Telomerase reverse transcriptase
Type:PROTEIN
Mol. Mass.:127099.03
Organism:Homo sapiens (Human)
Description:ChEMBL_1447029
Residue:1132
BDBM50134002
NameBDBM50134002
Synonyms:CHEMBL141540 N-[9-(2-Piperidin-1-yl-ethylamino)-6-(3-pyrrolidin-1-yl-propionylamino)-acridin-3-yl]-3-pyrrolidin-1-yl-propionamide
TypeSmall organic molecule
Emp. Form.C34H47N7O2
Mol. Mass.585.7827
SMILESO=C(CCN1CCCC1)Nc1ccc2c(NCCN3CCCCC3)c3ccc(NC(=O)CCN4CCCC4)cc3nc2c1