Reaction Details
TargetTelomerase reverse transcriptase
LigandBDBM50134000
Substrate/Competitorn/a
Meas. Tech.ChEMBL_622825 (CHEMBL1105835)
IC50 90±n/a nM
Citation Castillo-González, DCabrera-Pérez, MAPérez-González, MMorales Helguera, ADurán-Martínez, A Prediction of telomerase inhibitory activity for acridinic derivatives based on chemical structure. Eur J Med Chem44:4826-40 (2009) 
 
Telomerase reverse transcriptase
Name:Telomerase reverse transcriptase
Type:PROTEIN
Mol. Mass.:127099.03
Organism:Homo sapiens (Human)
Description:ChEMBL_1447029
Residue:1132
BDBM50134000
NameBDBM50134000
Synonyms:CHEMBL139287 N-[9-Cyclohexylamino-6-(3-pyrrolidin-1-yl-propionylamino)-acridin-3-yl]-3-pyrrolidin-1-yl-propionamide
TypeSmall organic molecule
Emp. Form.C33H44N6O2
Mol. Mass.556.7415
SMILESO=C(CCN1CCCC1)Nc1ccc2c(NC3CCCCC3)c3ccc(NC(=O)CCN4CCCC4)cc3nc2c1