Reaction Details
TargetTelomerase reverse transcriptase
LigandBDBM50134027
Substrate/Competitorn/a
Meas. Tech.ChEMBL_622825 (CHEMBL1105835)
IC50 18±n/a nM
Citation Castillo-González, DCabrera-Pérez, MAPérez-González, MMorales Helguera, ADurán-Martínez, A Prediction of telomerase inhibitory activity for acridinic derivatives based on chemical structure. Eur J Med Chem44:4826-40 (2009) 
 
Telomerase reverse transcriptase
Name:Telomerase reverse transcriptase
Type:PROTEIN
Mol. Mass.:127099.03
Organism:Homo sapiens (Human)
Description:ChEMBL_1447029
Residue:1132
BDBM50134027
NameBDBM50134027
Synonyms:CHEMBL140180 N-[9-(2-Dimethylamino-ethylamino)-6-(3-pyrrolidin-1-yl-propionylamino)-acridin-3-yl]-3-pyrrolidin-1-yl-propionamide
TypeSmall organic molecule
Emp. Form.C31H43N7O2
Mol. Mass.545.7188
SMILESCN(C)CCNc1c2ccc(NC(=O)CCN3CCCC3)cc2nc2cc(NC(=O)CCN3CCCC3)ccc12