Reaction Details
TargetTelomerase reverse transcriptase
LigandBDBM50134021
Substrate/Competitorn/a
Meas. Tech.ChEMBL_622825 (CHEMBL1105835)
IC50 100±n/a nM
Citation Castillo-González, DCabrera-Pérez, MAPérez-González, MMorales Helguera, ADurán-Martínez, A Prediction of telomerase inhibitory activity for acridinic derivatives based on chemical structure. Eur J Med Chem44:4826-40 (2009) 
 
Telomerase reverse transcriptase
Name:Telomerase reverse transcriptase
Type:PROTEIN
Mol. Mass.:127099.03
Organism:Homo sapiens (Human)
Description:ChEMBL_1447029
Residue:1132
BDBM50134021
NameBDBM50134021
Synonyms:CHEMBL138761 N-[9-(3-Methylsulfanyl-phenylamino)-6-(3-pyrrolidin-1-yl-propionylamino)-acridin-3-yl]-3-pyrrolidin-1-yl-propionamide
TypeSmall organic molecule
Emp. Form.C34H40N6O2S
Mol. Mass.596.785
SMILESCSc1cccc(Nc2c3ccc(NC(=O)CCN4CCCC4)cc3nc3cc(NC(=O)CCN4CCCC4)ccc23)c1