Reaction Details
TargetAdenosine receptor A2b
LigandBDBM50310932
Substrate/Competitorn/a
Meas. Tech.ChEMBL_622829 (CHEMBL1105839)
IC50 13±n/a nM
Citation Bedford, STBenwell, KRBrooks, TChen, IComer, MDugdale, SHaymes, TJordan, AMKennett, GAKnight, ARKlenke, BLeStrat, LMerrett, AMisra, ALightowler, SPadfield, APoullennec, KReece, MSimmonite, HWong, MYule, IA Discovery and optimization of potent and selective functional antagonists of the human adenosine A2B receptor. Bioorg Med Chem Lett19:5945-9 (2009) 
 
Adenosine receptor A2b
Name:Adenosine receptor A2b
Type:G Protein-Coupled Receptor (GPCR)
Mol. Mass.:36341.22
Organism:Homo sapiens (Human)
Description:n/a
Residue:332
BDBM50310932
NameBDBM50310932
Synonyms:(+/-)-[2-(1-Pyridin-3-yl-ethylamino)-thieno[3,2-d]pyrimidin-4-yl]-pyrrolidin-1-yl-methanone | CHEMBL1082064
TypeSmall organic molecule
Emp. Form.C18H19N5OS
Mol. Mass.353.441
SMILESCC(Nc1nc(C(=O)N2CCCC2)c2sccc2n1)c1cccnc1