Reaction Details
Target3-keto-steroid reductase/17-beta-hydroxysteroid dehydrogenase 7
LigandBDBM50311132
Substrate/Competitorn/a
Meas. Tech.ChEMBL_619853 (CHEMBL1106730)
IC50 195±n/a nM
Citation Bellavance, ELuu-The, VPoirier, D Potent and selective steroidal inhibitors of 17beta-hydroxysteroid dehydrogenase type 7, an enzyme that catalyzes the reduction of the key hormones estrone and dihydrotestosterone. J Med Chem52:7488-502 (2009) 
 
3-keto-steroid reductase/17-beta-hydroxysteroid dehydrogenase 7
Name:3-keto-steroid reductase/17-beta-hydroxysteroid dehydrogenase 7
Type:PROTEIN
Mol. Mass.:38212.81
Organism:Homo sapiens (Human)
Description:ChEMBL_619853
Residue:341
BDBM50311132
NameBDBM50311132
Synonyms:17beta-[(N-Decyl)formamido]-4-methyl-4-aza-5alpha-androstan-3-one | CHEMBL1079512
TypeSmall organic molecule
Emp. Form.C30H52N2O2
Mol. Mass.472.7461
SMILESCCCCCCCCCCN(C=O)C1CC[C@H]2[C@@H]3CC[C@H]4N(C)C(=O)CC[C@]4(C)[C@H]3CC[C@]12C