Reaction Details
TargetCathepsin B-like cysteine protease
LigandBDBM50311252
Substrate/Competitorn/a
Meas. Tech.ChEMBL_619863 (CHEMBL1109344)
IC50 16000±n/a nM
Citation Bryant, CKerr, IDDebnath, MAng, KKRatnam, JFerreira, RSJaishankar, PZhao, DArkin, MRMcKerrow, JHBrinen, LSRenslo, AR Novel non-peptidic vinylsulfones targeting the S2 and S3 subsites of parasite cysteine proteases. Bioorg Med Chem Lett19:6218-21 (2009) 
 
Cathepsin B-like cysteine protease
Name:Cathepsin B-like cysteine protease
Type:Enzyme
Mol. Mass.:37220.37
Organism:Trypanosoma brucei
Description:Enzyme was expressed in yeast Pichia pastoris.
Residue:340
BDBM50311252
NameBDBM50311252
Synonyms:(1R,2R)-2-(4-chlorobenzoyl)-N-((S)-5-phenyl-1-(phenylsulfonyl)pent-1-en-3-yl)cyclohexanecarboxamide | CHEMBL1079162
TypeSmall organic molecule
Emp. Form.C31H32ClNO4S
Mol. Mass.550.108
SMILESClc1ccc(cc1)C(=O)[C@@H]1CCCC[C@H]1C(=O)N[C@@H](CCc1ccccc1)C=CS(=O)(=O)c1ccccc1