Reaction Details
TargetSomatostatin receptor type 2
LigandBDBM50227117
Substrate/Competitorn/a
Meas. Tech.ChEMBL_621603 (CHEMBL1113035)
Ki>10000±n/a nM
Citation Martin, REMohr, PMaerki, HPGuba, WKuratli, CGavelle, OBinggeli, ABendels, SAlvarez-Sánchez, RAlker, APolonchuk, LChrist, AD Benzoxazole piperidines as selective and potent somatostatin receptor subtype 5 antagonists. Bioorg Med Chem Lett19:6106-13 (2009) 
 
Somatostatin receptor type 2
Name:Somatostatin receptor type 2
Type:Enzyme
Mol. Mass.:41344.94
Organism:Homo sapiens (Human)
Description:P30874
Residue:369
BDBM50227117
NameBDBM50227117
Synonyms:CHEMBL236611 | N-(1-(3-ethoxy-4-methylbenzyl)piperidin-4-yl)benzo[d]oxazol-2-amine
TypeSmall organic molecule
Emp. Form.C22H27N3O2
Mol. Mass.365.4687
SMILESCCOc1cc(CN2CCC(CC2)Nc2nc3ccccc3o2)ccc1C