Reaction Details
TargetNociceptin receptor
LigandBDBM50311486
Substrate/Competitorn/a
Meas. Tech.ChEMBL_622960 (CHEMBL1112212)
IC50 5.2±n/a nM
Citation Palin, RClark, JKEvans, LFeilden, HFletcher, DHamilton, NMHoughton, AKJones, PSMcArthur, DMontgomery, BRatcliffe, PDSmith, ARSutherland, AWeston, MAWishart, G Rapid access towards follow-up NOP receptor agonists using a knowledge based approach. Bioorg Med Chem Lett19:6441-6 (2009) 
 
Nociceptin receptor
Name:Nociceptin receptor
Type:G Protein-Coupled Receptor (GPCR)
Mol. Mass.:40702.87
Organism:Homo sapiens (Human)
Description:P41146
Residue:370
BDBM50311486
NameBDBM50311486
Synonyms:2-[1-(1-Cyclodecyl-piperidin-4-yl)-2,2-dioxo-1,4-dihydro-2H-2lambda*6*-benzo[1,2,6]thiadiazin-3-yl]-N-methyl-acetamide | CHEMBL1079400
TypeSmall organic molecule
Emp. Form.C25H40N4O3S
Mol. Mass.476.675
SMILESCNC(=O)CN1Cc2ccccc2N(C2CCN(CC2)C2CCCCCCCCC2)S1(=O)=O