Reaction Details
TargetNociceptin receptor
LigandBDBM50311473
Substrate/Competitorn/a
Meas. Tech.ChEMBL_622960 (CHEMBL1112212)
IC50 53±n/a nM
Citation Palin, RClark, JKEvans, LFeilden, HFletcher, DHamilton, NMHoughton, AKJones, PSMcArthur, DMontgomery, BRatcliffe, PDSmith, ARSutherland, AWeston, MAWishart, G Rapid access towards follow-up NOP receptor agonists using a knowledge based approach. Bioorg Med Chem Lett19:6441-6 (2009) 
 
Nociceptin receptor
Name:Nociceptin receptor
Type:G Protein-Coupled Receptor (GPCR)
Mol. Mass.:40702.87
Organism:Homo sapiens (Human)
Description:P41146
Residue:370
BDBM50311473
NameBDBM50311473
Synonyms:2-(8-(4-isopropylcyclohexyl)-1-oxo-4-phenyl-2,3,8-triazaspiro[4.5]dec-3-en-2-yl)-N-methylacetamide | CHEMBL1081191
TypeSmall organic molecule
Emp. Form.C25H36N4O2
Mol. Mass.424.5789
SMILESCNC(=O)CN1N=C(c2ccccc2)C2(CCN(CC2)C2CCC(CC2)C(C)C)C1=O