Reaction Details
TargetMu-type opioid receptor
LigandBDBM50311478
Substrate/Competitorn/a
Meas. Tech.ChEMBL_622958 (CHEMBL1112210)
Ki 14±n/a nM
Citation Palin, RClark, JKEvans, LFeilden, HFletcher, DHamilton, NMHoughton, AKJones, PSMcArthur, DMontgomery, BRatcliffe, PDSmith, ARSutherland, AWeston, MAWishart, G Rapid access towards follow-up NOP receptor agonists using a knowledge based approach. Bioorg Med Chem Lett19:6441-6 (2009) 
 
Mu-type opioid receptor
Name:Mu-type opioid receptor
Type:G Protein-Coupled Receptor (GPCR)
Mol. Mass.:44789.51
Organism:Homo sapiens (Human)
Description:P35372
Residue:400
BDBM50311478
NameBDBM50311478
Synonyms:2-{1-[1-(Decahydro-naphthalen-2-yl)-piperidin-4-yl]-2,2-dioxo-1,4-dihydro-2H-2lambda*6*-benzo[1,2,6]thiadiazin-3-yl}-N-methyl-acetamide | CHEMBL1079943
TypeSmall organic molecule
Emp. Form.C25H38N4O3S
Mol. Mass.474.659
SMILESCNC(=O)CN1Cc2ccccc2N(C2CCN(CC2)C2CCC3CCCCC3C2)S1(=O)=O