Reaction Details
TargetMu-type opioid receptor
LigandBDBM50311485
Substrate/Competitorn/a
Meas. Tech.ChEMBL_622958 (CHEMBL1112210)
Ki 107±n/a nM
Citation Palin, RClark, JKEvans, LFeilden, HFletcher, DHamilton, NMHoughton, AKJones, PSMcArthur, DMontgomery, BRatcliffe, PDSmith, ARSutherland, AWeston, MAWishart, G Rapid access towards follow-up NOP receptor agonists using a knowledge based approach. Bioorg Med Chem Lett19:6441-6 (2009) 
 
Mu-type opioid receptor
Name:Mu-type opioid receptor
Type:G Protein-Coupled Receptor (GPCR)
Mol. Mass.:44789.51
Organism:Homo sapiens (Human)
Description:P35372
Residue:400
BDBM50311485
NameBDBM50311485
Synonyms:2-[3-(1-Cyclodecyl-piperidin-4-yl)-2,2-dioxo-2,3-dihydro-2lambda*6*-benzo[1,2,5]thiadiazol-1-yl]-N-methyl-acetamide | CHEMBL1079571
TypeSmall organic molecule
Emp. Form.C24H38N4O3S
Mol. Mass.462.649
SMILESCNC(=O)CN1c2ccccc2N(C2CCN(CC2)C2CCCCCCCCC2)S1(=O)=O