Reaction Details
TargetNociceptin receptor
LigandBDBM50311505
Substrate/Competitorn/a
Meas. Tech.ChEMBL_622957 (CHEMBL1112209)
Ki 3.5±n/a nM
Citation Palin, RClark, JKEvans, LFeilden, HFletcher, DHamilton, NMHoughton, AKJones, PSMcArthur, DMontgomery, BRatcliffe, PDSmith, ARSutherland, AWeston, MAWishart, G Rapid access towards follow-up NOP receptor agonists using a knowledge based approach. Bioorg Med Chem Lett19:6441-6 (2009) 
 
Nociceptin receptor
Name:Nociceptin receptor
Type:G Protein-Coupled Receptor (GPCR)
Mol. Mass.:40702.87
Organism:Homo sapiens (Human)
Description:P41146
Residue:370
BDBM50311505
NameBDBM50311505
Synonyms:2-(3-(1-(decahydronaphthalen-2-yl)piperidin-4-yl)-2-oxo-2,3-dihydro-1H-benzo[d]imidazol-1-yl)-N-methylacetamide | CHEMBL1087278
TypeSmall organic molecule
Emp. Form.C25H36N4O2
Mol. Mass.424.5789
SMILESCNC(=O)Cn1c2ccccc2n(C2CCN(CC2)C2CCC3CCCCC3C2)c1=O