Reaction Details
TargetNociceptin receptor
LigandBDBM50311509
Substrate/Competitorn/a
Meas. Tech.ChEMBL_622957 (CHEMBL1112209)
Ki 5.2±n/a nM
Citation Palin, RClark, JKEvans, LFeilden, HFletcher, DHamilton, NMHoughton, AKJones, PSMcArthur, DMontgomery, BRatcliffe, PDSmith, ARSutherland, AWeston, MAWishart, G Rapid access towards follow-up NOP receptor agonists using a knowledge based approach. Bioorg Med Chem Lett19:6441-6 (2009) 
 
Nociceptin receptor
Name:Nociceptin receptor
Type:G Protein-Coupled Receptor (GPCR)
Mol. Mass.:40702.87
Organism:Homo sapiens (Human)
Description:P41146
Residue:370
BDBM50311509
NameBDBM50311509
Synonyms:2-(3-(1-(4,4-dimethylcyclohexyl)piperidin-4-yl)-2-oxo-2,3-dihydro-1H-benzo[d]imidazol-1-yl)-N-methylacetamide | CHEMBL1087532
TypeSmall organic molecule
Emp. Form.C23H34N4O2
Mol. Mass.398.5417
SMILESCNC(=O)Cn1c2ccccc2n(C2CCN(CC2)C2CCC(C)(C)CC2)c1=O