Reaction Details
TargetNitric oxide synthase, brain
LigandBDBM50279392
Substrate/Competitorn/a
Meas. Tech.ChEMBL_619387 (CHEMBL1104145)
Ki 15±n/a nM
Citation Xue, FFang, JLewis, WWMartásek, PRoman, LJSilverman, RB Potent and selective neuronal nitric oxide synthase inhibitors with improved cellular permeability. Bioorg Med Chem Lett20:554-7 (2010) 
 
Nitric oxide synthase, brain
Name:Nitric oxide synthase, brain
Type:Enzyme
Mol. Mass.:160570.98
Organism:Rattus norvegicus (rat)
Description:Recombinant nNOS overexpressed in E. coli was used in enzyme assays.
Residue:1429
BDBM50279392
NameBDBM50279392
Synonyms:(+/-)-6-((4-(2-(3-fluorophenethylamino)ethoxy)pyrrolidin-3-yl)methyl)-4-methylpyridin-2-amine | CHEMBL446971
TypeSmall organic molecule
Emp. Form.C21H29FN4O
Mol. Mass.372.4796
SMILESCc1cc(N)nc(CC2CNCC2OCCNCCc2cccc(F)c2)c1