Reaction Details
TargetLysosomal alpha-glucosidase
LigandBDBM50242271
Substrate/Competitorn/a
Meas. Tech.ChEMBL_617535 (CHEMBL1099885)
IC50 2000±n/a nM
Citation Wennekes, TMeijer, AJGroen, AKBoot, RGGroener, JEvan Eijk, MOttenhoff, RBijl, NGhauharali, KSong, HO'Shea, TJLiu, HYew, NCopeland, Dvan den Berg, RJvan der Marel, GAOverkleeft, HSAerts, JM Dual-action lipophilic iminosugar improves glycemic control in obese rodents by reduction of visceral glycosphingolipids and buffering of carbohydrate assimilation. J Med Chem53:689-98 (2010) 
 
Lysosomal alpha-glucosidase
Name:Lysosomal alpha-glucosidase
Type:PROTEIN
Mol. Mass.:105312.45
Organism:Homo sapiens (Human)
Description:ChEMBL_1506060
Residue:952
BDBM50242271
NameBDBM50242271
Synonyms:(2R,3R,4R,5S)-1-(2-hydroxyethyl)-2-(hydroxymethyl)piperidine-3,4,5-triol BAY-M-1099 Glyset N-Hydroxyethyl-1-deoxynojirimycin | cid_441314
TypeSmall organic molecule
Emp. Form.C8H17NO5
Mol. Mass.207.2243
SMILESOCCN1C[C@H](O)[C@@H](O)[C@H](O)[C@H]1CO