Reaction Details
TargetLysosomal alpha-glucosidase
LigandBDBM50312527
Substrate/Competitorn/a
Meas. Tech.ChEMBL_617535 (CHEMBL1099885)
IC50>1000000±n/a nM
Citation Wennekes, TMeijer, AJGroen, AKBoot, RGGroener, JEvan Eijk, MOttenhoff, RBijl, NGhauharali, KSong, HO'Shea, TJLiu, HYew, NCopeland, Dvan den Berg, RJvan der Marel, GAOverkleeft, HSAerts, JM Dual-action lipophilic iminosugar improves glycemic control in obese rodents by reduction of visceral glycosphingolipids and buffering of carbohydrate assimilation. J Med Chem53:689-98 (2010) 
 
Lysosomal alpha-glucosidase
Name:Lysosomal alpha-glucosidase
Type:PROTEIN
Mol. Mass.:105312.45
Organism:Homo sapiens (Human)
Description:ChEMBL_1506060
Residue:952
BDBM50312527
NameBDBM50312527
Synonyms:CHEMBL1086996 | N-[5-(Adamantan-1-yl-methoxy)-pentyl]-L-ido-1-deoxynojirimycin
TypeSmall organic molecule
Emp. Form.C22H39NO5
Mol. Mass.397.5488
SMILESOC[C@H]1[C@@H](O)[C@H](O)[C@@H](O)CN1CCCCCOCC12CC3CC(CC(C3)C1)C2