Reaction Details
TargetGlycogen debranching enzyme
LigandBDBM50312527
Substrate/Competitorn/a
Meas. Tech.ChEMBL_617536 (CHEMBL1099886)
IC50>100000±n/a nM
Citation Wennekes, TMeijer, AJGroen, AKBoot, RGGroener, JEvan Eijk, MOttenhoff, RBijl, NGhauharali, KSong, HO'Shea, TJLiu, HYew, NCopeland, Dvan den Berg, RJvan der Marel, GAOverkleeft, HSAerts, JM Dual-action lipophilic iminosugar improves glycemic control in obese rodents by reduction of visceral glycosphingolipids and buffering of carbohydrate assimilation. J Med Chem53:689-98 (2010) 
 
Glycogen debranching enzyme
Name:Glycogen debranching enzyme
Type:PROTEIN
Mol. Mass.:174768.28
Organism:Homo sapiens (Human)
Description:ChEMBL_491004
Residue:1532
BDBM50312527
NameBDBM50312527
Synonyms:CHEMBL1086996 | N-[5-(Adamantan-1-yl-methoxy)-pentyl]-L-ido-1-deoxynojirimycin
TypeSmall organic molecule
Emp. Form.C22H39NO5
Mol. Mass.397.5488
SMILESOC[C@H]1[C@@H](O)[C@H](O)[C@@H](O)CN1CCCCCOCC12CC3CC(CC(C3)C1)C2