Reaction Details
TargetNeuronal acetylcholine receptor subunit alpha-4/beta-2
LigandBDBM50312545
Substrate/Competitorn/a
Meas. Tech.ChEMBL_615093 (CHEMBL1106034)
Ki 0.021±n/a nM
Citation Carroll, FIMa, WDeng, LNavarro, HADamaj, MIMartin, BR Synthesis, nicotinic acetylcholine receptor binding, and antinociceptive properties of 3'-(substituted phenyl)epibatidine analogues. Nicotinic partial agonists. J Nat Prod73:306-12 (2010) 
 
Neuronal acetylcholine receptor subunit alpha-4/beta-2
Name:Neuronal acetylcholine receptor subunit alpha-4/beta-2
Type:n/a
Mol. Mass.:n/a
Description:n/a
Components:This complex has 0 components.
Component 1
Name:Neuronal acetylcholine receptor subunit alpha-4
Synonyms:ACHA4_RAT Cholinergic, Nicotinic Alpha4Beta2 Chrna4 Neuronal acetylcholine receptor (alpha4beta2 nAChR) Neuronal acetylcholine receptor subunit alpha 4 beta 2 | Neuronal acetylcholine receptor subunit alpha-4
Type:Enzyme
Mol. Mass.:70196.44
Organism:Rattus norvegicus (Rat)
Description:P09483
Residue:630
Component 2
Name:Neuronal acetylcholine receptor subunit beta-2
Synonyms:ACHB2_RAT Chrnb2 Neuronal acetylcholine receptor non-alpha-1 chain
Type:Enzyme
Mol. Mass.:56910.32
Organism:Rattus norvegicus (Rat)
Description:P12390
Residue:500
BDBM50312545
NameBDBM50312545
Synonyms:(1R,2R,4S)-2-(6-chloro-5-phenylpyridin-3-yl)-7-azabicyclo[2.2.1]heptane | CHEMBL1075632
TypeSmall organic molecule
Emp. Form.C17H17ClN2
Mol. Mass.284.783
SMILESClc1ncc(cc1-c1ccccc1)[C@H]1C[C@@H]2CC[C@H]1N2