Reaction Details
TargetNeuronal acetylcholine receptor subunit alpha-4/beta-2
LigandBDBM50312549
Substrate/Competitorn/a
Meas. Tech.ChEMBL_615093 (CHEMBL1106034)
Ki 0.013±n/a nM
Citation Carroll, FIMa, WDeng, LNavarro, HADamaj, MIMartin, BR Synthesis, nicotinic acetylcholine receptor binding, and antinociceptive properties of 3'-(substituted phenyl)epibatidine analogues. Nicotinic partial agonists. J Nat Prod73:306-12 (2010) 
 
Neuronal acetylcholine receptor subunit alpha-4/beta-2
Name:Neuronal acetylcholine receptor subunit alpha-4/beta-2
Type:n/a
Mol. Mass.:n/a
Description:n/a
Components:This complex has 0 components.
Component 1
Name:Neuronal acetylcholine receptor subunit alpha-4
Synonyms:ACHA4_RAT Cholinergic, Nicotinic Alpha4Beta2 Chrna4 Neuronal acetylcholine receptor (alpha4beta2 nAChR) Neuronal acetylcholine receptor subunit alpha 4 beta 2 | Neuronal acetylcholine receptor subunit alpha-4
Type:Enzyme
Mol. Mass.:70196.44
Organism:Rattus norvegicus (Rat)
Description:P09483
Residue:630
Component 2
Name:Neuronal acetylcholine receptor subunit beta-2
Synonyms:ACHB2_RAT Chrnb2 Neuronal acetylcholine receptor non-alpha-1 chain
Type:Enzyme
Mol. Mass.:56910.32
Organism:Rattus norvegicus (Rat)
Description:P12390
Residue:500
BDBM50312549
NameBDBM50312549
Synonyms:3'-(3-Chlorophenyl)epibatidine | CHEMBL1098031
TypeSmall organic molecule
Emp. Form.C17H16Cl2N2
Mol. Mass.319.228
SMILESClc1cccc(c1)-c1cc(cnc1Cl)[C@H]1C[C@@H]2CC[C@H]1N2