Reaction Details
TargetCannabinoid receptor 2
LigandBDBM50312591
Substrate/Competitorn/a
Meas. Tech.ChEMBL_615552 (CHEMBL1107821)
Ki 2928±n/a nM
Citation Meng, TWang, JPeng, HFang, GLi, MXiong, BXie, XZhang, YWang, XShen, J Discovery of benzhydrylpiperazine derivatives as CB1 receptor inverse agonists via privileged structure-based approach. Eur J Med Chem45:1133-9 (2010) 
 
Cannabinoid receptor 2
Name:Cannabinoid receptor 2
Type:G Protein-Coupled Receptor (GPCR)
Mol. Mass.:39690.94
Organism:Homo sapiens (Human)
Description:P34972
Residue:360
BDBM50312591
NameBDBM50312591
Synonyms:1-(Cyclohexylcarbonyl)-4-[(2,4-dichlorophenyl)(phenyl)methyl]piperazine | CHEMBL1087644
TypeSmall organic molecule
Emp. Form.C24H28Cl2N2O
Mol. Mass.431.398
SMILESClc1ccc(C(N2CCN(CC2)C(=O)C2CCCCC2)c2ccccc2)c(Cl)c1