Reaction Details
TargetCannabinoid receptor 1
LigandBDBM50312592
Substrate/Competitorn/a
Meas. Tech.ChEMBL_615553 (CHEMBL1107822)
IC50 288±n/a nM
Citation Meng, TWang, JPeng, HFang, GLi, MXiong, BXie, XZhang, YWang, XShen, J Discovery of benzhydrylpiperazine derivatives as CB1 receptor inverse agonists via privileged structure-based approach. Eur J Med Chem45:1133-9 (2010) 
 
Cannabinoid receptor 1
Name:Cannabinoid receptor 1
Type:G Protein-Coupled Receptor (GPCR)
Mol. Mass.:52868.96
Organism:Homo sapiens (Human)
Description:P21554
Residue:472
BDBM50312592
NameBDBM50312592
Synonyms:1-(1-adamantylcarbonyl)-4-[(2,4-dichlorophenyl)(phenyl)methyl]piperazine | CHEMBL1095690
TypeSmall organic molecule
Emp. Form.C28H32Cl2N2O
Mol. Mass.483.472
SMILESClc1ccc(C(N2CCN(CC2)C(=O)C23CC4CC(CC(C4)C2)C3)c2ccccc2)c(Cl)c1