Reaction Details
TargetCannabinoid receptor 1
LigandBDBM50312596
Substrate/Competitorn/a
Meas. Tech.ChEMBL_615553 (CHEMBL1107822)
IC50 4.7±n/a nM
Citation Meng, TWang, JPeng, HFang, GLi, MXiong, BXie, XZhang, YWang, XShen, J Discovery of benzhydrylpiperazine derivatives as CB1 receptor inverse agonists via privileged structure-based approach. Eur J Med Chem45:1133-9 (2010) 
 
Cannabinoid receptor 1
Name:Cannabinoid receptor 1
Type:G Protein-Coupled Receptor (GPCR)
Mol. Mass.:52868.96
Organism:Homo sapiens (Human)
Description:P21554
Residue:472
BDBM50312596
NameBDBM50312596
Synonyms:4-[(2,4-Dichlorophenyl)(phenyl)methyl]-N-piperidin-1-ylpiperazine-1-carboxamide | CHEMBL1093078
TypeSmall organic molecule
Emp. Form.C23H28Cl2N4O
Mol. Mass.447.401
SMILESClc1ccc(C(N2CCN(CC2)C(=O)NN2CCCCC2)c2ccccc2)c(Cl)c1