Reaction Details
TargetCannabinoid receptor 1
LigandBDBM50312604
Substrate/Competitorn/a
Meas. Tech.ChEMBL_615551 (CHEMBL1107820)
Ki 2.5±n/a nM
Citation Meng, TWang, JPeng, HFang, GLi, MXiong, BXie, XZhang, YWang, XShen, J Discovery of benzhydrylpiperazine derivatives as CB1 receptor inverse agonists via privileged structure-based approach. Eur J Med Chem45:1133-9 (2010) 
 
Cannabinoid receptor 1
Name:Cannabinoid receptor 1
Type:G Protein-Coupled Receptor (GPCR)
Mol. Mass.:52868.96
Organism:Homo sapiens (Human)
Description:P21554
Residue:472
BDBM50312604
NameBDBM50312604
Synonyms:CHEMBL1084695 | N-cyclohexyl-4-[(2,4-dichlorophenyl)(4-fluorophenyl)methyl]piperazine-1-carboxamide
TypeSmall organic molecule
Emp. Form.C24H28Cl2FN3O
Mol. Mass.464.403
SMILESFc1ccc(cc1)C(N1CCN(CC1)C(=O)NC1CCCCC1)c1ccc(Cl)cc1Cl