Reaction Details
TargetCannabinoid receptor 2
LigandBDBM50312602
Substrate/Competitorn/a
Meas. Tech.ChEMBL_615552 (CHEMBL1107821)
Ki 52±n/a nM
Citation Meng, TWang, JPeng, HFang, GLi, MXiong, BXie, XZhang, YWang, XShen, J Discovery of benzhydrylpiperazine derivatives as CB1 receptor inverse agonists via privileged structure-based approach. Eur J Med Chem45:1133-9 (2010) 
 
Cannabinoid receptor 2
Name:Cannabinoid receptor 2
Type:G Protein-Coupled Receptor (GPCR)
Mol. Mass.:39690.94
Organism:Homo sapiens (Human)
Description:P34972
Residue:360
BDBM50312602
NameBDBM50312602
Synonyms:CHEMBL1091814 | N-cyclohexyl-4-[(2,4-dichlorophenyl)(4-phenoxyphenyl)methyl]piperazine-1-carboxamide
TypeSmall organic molecule
Emp. Form.C30H33Cl2N3O2
Mol. Mass.538.508
SMILESClc1ccc(C(N2CCN(CC2)C(=O)NC2CCCCC2)c2ccc(Oc3ccccc3)cc2)c(Cl)c1