Reaction Details
TargetSialidase-2
LigandBDBM50187658
Substrate/Competitorn/a
Meas. Tech.ChEMBL_617801 (CHEMBL1100507)
IC50>1000000±n/a nM
Citation Arioka, SSakagami, MUematsu, RYamaguchi, HTogame, HTakemoto, HHinou, HNishimura, S Potent inhibitor scaffold against Trypanosoma cruzi trans-sialidase. Bioorg Med Chem18:1633-40 (2010) 
 
Sialidase-2
Name:Sialidase-2
Type:PROTEIN
Mol. Mass.:42256.20
Organism:Homo sapiens (Human)
Description:ChEMBL_960638
Residue:380
BDBM50187658
NameBDBM50187658
Synonyms:4',5-dihydroxy-7-methoxy flavone 5-hydroxy-2-(4-hydroxyphenyl)-7-methoxy-4H-chromen-4-one CHEMBL210635 genkwanin
TypeSmall organic molecule
Emp. Form.C16H12O5
Mol. Mass.284.2635
SMILESCOc1cc(O)c2c(c1)oc(cc2=O)-c1ccc(O)cc1