Reaction Details
TargetBeta-adrenergic receptor kinase 2
LigandBDBM3149
Substrate/Competitorn/a
Meas. Tech.ChEMBL_615172 (CHEMBL1106957)
IC50 47±n/a nM
Citation Tesmer, JJTesmer, VMLodowski, DTSteinhagen, HHuber, J Structure of human G protein-coupled receptor kinase 2 in complex with the kinase inhibitor balanol. J Med Chem53:1867-70 (2010) 
 
Beta-adrenergic receptor kinase 2
Name:Beta-adrenergic receptor kinase 2
Type:PROTEIN
Mol. Mass.:79721.92
Organism:Homo sapiens (Human)
Description:ChEMBL_615172
Residue:688
BDBM3149
NameBDBM3149
Synonyms:2-{[2,6-dihydroxy-4-({[(3R,4R)-3-[(4-hydroxybenzene)amido]azepan-4-yl]oxy}carbonyl)phenyl]carbonyl}-3-hydroxybenzoic acid Balanol analog 1 CHEMBL60254
TypeSmall organic molecule
Emp. Form.C28H26N2O10
Mol. Mass.550.5134
SMILESOC(=O)c1cccc(O)c1C(=O)c1c(O)cc(cc1O)C(=O)O[C@@H]1CCCNC[C@H]1NC(=O)c1ccc(O)cc1