Reaction Details
TargetAdenosine receptor A1
LigandBDBM50211685
Substrate/Competitorn/a
Meas. Tech.ChEMBL_616080 (CHEMBL1102043)
Ki 2821±n/a nM
Citation Eastwood, PGonzalez, JParedes, SNueda, ADomenech, TAlberti, JVidal, B Discovery of N-(5,6-diarylpyridin-2-yl)amide derivatives as potent and selective A(2B) adenosine receptor antagonists. Bioorg Med Chem Lett20:1697-700 (2010) 
 
Adenosine receptor A1
Name:Adenosine receptor A1
Type:G Protein-Coupled Receptor (GPCR)
Mol. Mass.:36520.92
Organism:Homo sapiens (Human)
Description:P30542
Residue:326
BDBM50211685
NameBDBM50211685
Synonyms:4'-(2-furyl)-N-pyridin-3-yl-4,5'-bipyrimidin-2'-amine CHEMBL375293
TypeSmall organic molecule
Emp. Form.C17H12N6O
Mol. Mass.316.3168
SMILESN(c1cccnc1)c1ncc(-c2ccncn2)c(n1)-c1ccco1