Reaction Details
TargetThymidine phosphorylase
LigandBDBM50313094
Substrate/Competitorn/a
Meas. Tech.ChEMBL_616439 (CHEMBL1100898)
Ki 17±n/a nM
Citation Jain, HVRasheed, RKalman, TI The role of phosphate in the action of thymidine phosphorylase inhibitors: Implications for the catalytic mechanism. Bioorg Med Chem Lett20:1648-51 (2010) 
 
Thymidine phosphorylase
Name:Thymidine phosphorylase
Type:Enzyme
Mol. Mass.:49948.87
Organism:Homo sapiens (Human)
Description:The recombinant human thymidine phosphorylase (V79TP) was expressed in V79 Chinese hamster cells (Sigma, T-9319).
Residue:482
BDBM50313094
NameBDBM50313094
Synonyms:5-fluoro-6-[(2-aminoimidazol-1-yl)methyl]uracil | CHEMBL1080896
TypeSmall organic molecule
Emp. Form.C8H8FN5O2
Mol. Mass.225.1798
SMILESNc1nccn1Cc1[nH]c(=O)[nH]c(=O)c1F