Reaction Details
TargetDelta-type opioid receptor
LigandBDBM50313235
Substrate/Competitorn/a
Meas. Tech.ChEMBL_616851 (CHEMBL1100235)
Ki 200±n/a nM
Citation Fulton, BSKnapp, BLBidlack, JMNeumeyer, JL Effect of linker substitution on the binding of butorphan univalent and bivalent ligands to opioid receptors. Bioorg Med Chem Lett20:1507-9 (2010) 
 
Delta-type opioid receptor
Name:Delta-type opioid receptor
Type:G Protein-Coupled Receptor (GPCR)
Mol. Mass.:40382.98
Organism:Homo sapiens (Human)
Description:Competition binding assays were carried out using membrane preparations from transfected HN9.10 cells that constitutively expressed the delta opioid receptor.
Residue:372
BDBM50313235
NameBDBM50313235
Synonyms:(1R,9R,10R)-17-(cyclobutylmethyl)-4-(oxiran-2-ylmethoxy)-17-azatetracyclo[7.5.3.0^{1,10}.0^{2,7}]heptadeca-2,4,6-triene | CHEMBL1081084
TypeSmall organic molecule
Emp. Form.C24H33NO2
Mol. Mass.367.5243
SMILESC(Oc1ccc2C[C@@H]3[C@@H]4CCCC[C@]4(CCN3CC3CCC3)c2c1)C1CO1