Reaction Details
TargetKappa-type opioid receptor
LigandBDBM50135802
Substrate/Competitorn/a
Meas. Tech.ChEMBL_616850 (CHEMBL1100234)
Ki 18±n/a nM
Citation Fulton, BSKnapp, BLBidlack, JMNeumeyer, JL Effect of linker substitution on the binding of butorphan univalent and bivalent ligands to opioid receptors. Bioorg Med Chem Lett20:1507-9 (2010) 
 
Kappa-type opioid receptor
Name:Kappa-type opioid receptor
Type:G Protein-Coupled Receptor (GPCR)
Mol. Mass.:42648.76
Organism:Homo sapiens (Human)
Description:P41145
Residue:380
BDBM50135802
NameBDBM50135802
Synonyms:(1R,9R,10R)-17-(cyclobutylmethyl)-4-(4-{[(1R,9R,10R)-17-(cyclobutylmethyl)-17-azatetracyclo[7.5.3.0^{1,10}.0^{2,7}]heptadeca-2,4,6-trien-4-yl]oxy}butoxy)-17-azatetracyclo[7.5.3.0^{1,10}.0^{2,7}]heptadeca-2,4,6-triene CHEMBL348023 MCL-154
TypeSmall organic molecule
Emp. Form.C46H64N2O2
Mol. Mass.677.0126
SMILESC(CCOc1ccc2C[C@@H]3[C@@H]4CCCC[C@]4(CCN3CC3CCC3)c2c1)COc1ccc2C[C@@H]3[C@@H]4CCCC[C@]4(CCN3CC3CCC3)c2c1