Reaction Details
TargetSphingosine 1-phosphate receptor 1
LigandBDBM50147707
Substrate/Competitorn/a
Meas. Tech.ChEMBL_617670 (CHEMBL1101466)
IC50 1900±n/a nM
Citation Högenauer, KHinterding, KNussbaumer, P S1P receptor mediated activity of FTY720 phosphate mimics. Bioorg Med Chem Lett20:1485-7 (2010) 
 
Sphingosine 1-phosphate receptor 1
Name:Sphingosine 1-phosphate receptor 1
Type:Enzyme
Mol. Mass.:42836.02
Organism:Homo sapiens (Human)
Description:P21453
Residue:382
BDBM50147707
NameBDBM50147707
Synonyms:3-Amino-5-(4-octyl-phenyl)-pentanoic acid CHEMBL326346
TypeSmall organic molecule
Emp. Form.C19H31NO2
Mol. Mass.305.4549
SMILESCCCCCCCCc1ccc(CCC(N)CC(O)=O)cc1