Reaction Details
TargetSphingosine 1-phosphate receptor 1
LigandBDBM50313502
Substrate/Competitorn/a
Meas. Tech.ChEMBL_617665 (CHEMBL1101461)
EC50 240±n/a nM
Citation Högenauer, KHinterding, KNussbaumer, P S1P receptor mediated activity of FTY720 phosphate mimics. Bioorg Med Chem Lett20:1485-7 (2010) 
 
Sphingosine 1-phosphate receptor 1
Name:Sphingosine 1-phosphate receptor 1
Type:Enzyme
Mol. Mass.:42836.02
Organism:Homo sapiens (Human)
Description:P21453
Residue:382
BDBM50313502
NameBDBM50313502
Synonyms:(S)-4-amino-6-(4-(heptyloxy)phenyl)-4-methylhexanoic acid | CHEMBL1077288
TypeSmall organic molecule
Emp. Form.C20H33NO3
Mol. Mass.335.4809
SMILESCCCCCCCOc1ccc(CC[C@](C)(N)CCC(O)=O)cc1