Reaction Details
TargetSphingosine 1-phosphate receptor 1
LigandBDBM50313495
Substrate/Competitorn/a
Meas. Tech.ChEMBL_617665 (CHEMBL1101461)
EC50 44±n/a nM
Citation Högenauer, KHinterding, KNussbaumer, P S1P receptor mediated activity of FTY720 phosphate mimics. Bioorg Med Chem Lett20:1485-7 (2010) 
 
Sphingosine 1-phosphate receptor 1
Name:Sphingosine 1-phosphate receptor 1
Type:Enzyme
Mol. Mass.:42836.02
Organism:Homo sapiens (Human)
Description:P21453
Residue:382
BDBM50313495
NameBDBM50313495
Synonyms:(S)-2-amino-4-(4-(heptyloxy)phenyl)-2-methylbutanoic acid | CHEMBL1086171
TypeSmall organic molecule
Emp. Form.C18H29NO3
Mol. Mass.307.4278
SMILESCCCCCCCOc1ccc(CC[C@](C)(N)C(O)=O)cc1