Reaction Details
TargetSphingosine 1-phosphate receptor 2
LigandBDBM50313500
Substrate/Competitorn/a
Meas. Tech.ChEMBL_617666 (CHEMBL1101462)
IC50>22000±n/a nM
Citation Högenauer, KHinterding, KNussbaumer, P S1P receptor mediated activity of FTY720 phosphate mimics. Bioorg Med Chem Lett20:1485-7 (2010) 
 
Sphingosine 1-phosphate receptor 2
Name:Sphingosine 1-phosphate receptor 2
Type:G Protein-Coupled Receptor (GPCR)
Mol. Mass.:38883.16
Organism:Homo sapiens (Human)
Description:Membranes isolated from S1P2-transfected CHO cells were used in ligand binding assay.
Residue:353
BDBM50313500
NameBDBM50313500
Synonyms:(S)-3-amino-5-(4-(heptyloxy)phenyl)-3-methylpentane-1-sulfonic acid | CHEMBL1084930
TypeSmall organic molecule
Emp. Form.C19H33NO4S
Mol. Mass.371.535
SMILESCCCCCCCOc1ccc(CC[C@](C)(N)CCS(O)(=O)=O)cc1