Reaction Details
TargetSphingosine 1-phosphate receptor 3
LigandBDBM50313496
Substrate/Competitorn/a
Meas. Tech.ChEMBL_617667 (CHEMBL1101463)
EC50 300±n/a nM
Citation Högenauer, KHinterding, KNussbaumer, P S1P receptor mediated activity of FTY720 phosphate mimics. Bioorg Med Chem Lett20:1485-7 (2010) 
 
Sphingosine 1-phosphate receptor 3
Name:Sphingosine 1-phosphate receptor 3
Type:G Protein-Coupled Receptor (GPCR)
Mol. Mass.:42278.13
Organism:Homo sapiens (Human)
Description:Q99500
Residue:378
BDBM50313496
NameBDBM50313496
Synonyms:(S)-3-amino-5-(4-(heptyloxy)phenyl)-3-methylpentanoic acid | CHEMBL1086172
TypeSmall organic molecule
Emp. Form.C19H31NO3
Mol. Mass.321.4543
SMILESCCCCCCCOc1ccc(CC[C@](C)(N)CC(O)=O)cc1