Reaction Details
TargetInsulin-like growth factor 1 receptor
LigandBDBM50313651
Substrate/Competitorn/a
Meas. Tech.ChEMBL_614514 (CHEMBL1111487)
EC50 86±n/a nM
Citation Morphy, R Selectively nonselective kinase inhibition: striking the right balance. J Med Chem53:1413-37 (2010) 
 
Insulin-like growth factor 1 receptor
Name:Insulin-like growth factor 1 receptor
Type:Protein
Mol. Mass.:154776.79
Organism:Homo sapiens (Human)
Description:P08069
Residue:1367
BDBM50313651
NameBDBM50313651
Synonyms:7-(3-(azetidin-1-ylmethyl)cyclobutyl)-5-(4-(benzyloxy)phenyl)-7H-pyrrolo[2,3-d]pyrimidin-4-amine | CHEMBL1083527
TypeSmall organic molecule
Emp. Form.C27H29N5O
Mol. Mass.439.5521
SMILESNc1ncnc2n(cc(-c3ccc(OCc4ccccc4)cc3)c12)[C@@H]1C[C@H](CN2CCC2)C1