Reaction Details
TargetDual specificity tyrosine-phosphorylation-regulated kinase 1A
LigandBDBM50313641
Substrate/Competitorn/a
Meas. Tech.ChEMBL_614722 (CHEMBL1114225)
IC50 410±n/a nM
Citation Morphy, R Selectively nonselective kinase inhibition: striking the right balance. J Med Chem53:1413-37 (2010) 
 
Dual specificity tyrosine-phosphorylation-regulated kinase 1A
Name:Dual specificity tyrosine-phosphorylation-regulated kinase 1A
Type:Enzyme
Mol. Mass.:85616.61
Organism:Homo sapiens (Human)
Description:Q13627
Residue:763
BDBM50313641
NameBDBM50313641
Synonyms:3,6-diamino-4-phenyl-1H-indazole-5-carbonitrile | CHEMBL1077347
TypeSmall organic molecule
Emp. Form.C14H11N5
Mol. Mass.249.2706
SMILESNc1n[nH]c2cc(N)c(C#N)c(-c3ccccc3)c12