Reaction Details
TargetEpidermal growth factor receptor
LigandBDBM50307768
Substrate/Competitorn/a
Meas. Tech.ChEMBL_614501 (CHEMBL1111474)
IC50 2.4±n/a nM
Citation Morphy, R Selectively nonselective kinase inhibition: striking the right balance. J Med Chem53:1413-37 (2010) 
 
Epidermal growth factor receptor
Name:Epidermal growth factor receptor
Type:Receptor Kinase Domain
Mol. Mass.:134279.59
Organism:Homo sapiens (Human)
Description:P00533
Residue:1210
BDBM50307768
NameBDBM50307768
Synonyms:7-(4-(3-Ethynylphenylamino)-7-methoxyquinazolin-6-yloxy)-N-hydroxyheptanamide CUDC-101
TypeSmall organic molecule
Emp. Form.C24H26N4O4
Mol. Mass.434.4876
SMILESCOc1cc2ncnc(Nc3cccc(c3)C#C)c2cc1OCCCCCCC(=O)NO