Reaction Details
TargetRAC-alpha serine/threonine-protein kinase
LigandBDBM50256718
Substrate/Competitorn/a
Meas. Tech.ChEMBL_614504 (CHEMBL1111477)
IC50 4±n/a nM
Citation Morphy, R Selectively nonselective kinase inhibition: striking the right balance. J Med Chem53:1413-37 (2010) 
 
RAC-alpha serine/threonine-protein kinase
Name:RAC-alpha serine/threonine-protein kinase
Type:Enzyme
Mol. Mass.:55681.25
Organism:Homo sapiens (Human)
Description:P31749
Residue:480
BDBM50256718
NameBDBM50256718
Synonyms:9-phenyl-8-(4-((4-(5-(pyridin-2-yl)-1H-1,2,4-triazol-3-yl)piperidin-1-yl)methyl)phenyl)-[1,2,4]triazolo[3,4-f][1,6]naphthyridine | CHEMBL447328
TypeSmall organic molecule
Emp. Form.C34H29N9
Mol. Mass.563.6544
SMILESC(N1CCC(CC1)c1nnc([nH]1)-c1ccccn1)c1ccc(cc1)-c1nc2ccn3cnnc3c2cc1-c1ccccc1