Reaction Details
TargetVascular endothelial growth factor receptor 2
LigandBDBM50188749
Substrate/Competitorn/a
Meas. Tech.ChEMBL_614496 (CHEMBL1110564)
IC50 11±n/a nM
Citation Morphy, R Selectively nonselective kinase inhibition: striking the right balance. J Med Chem53:1413-37 (2010) 
 
Vascular endothelial growth factor receptor 2
Name:Vascular endothelial growth factor receptor 2
Type:Receptor Tyrosine Kinase
Mol. Mass.:151510.97
Organism:Homo sapiens (Human)
Description:P35968
Residue:1356
BDBM50188749
NameBDBM50188749
Synonyms:1-methyl-1-((5-(7-((4-methylpiperazin-1-yl)methyl)-1,4-dihydroindeno[1,2-c]pyrazol-3-yl)thiophen-2-yl)methyl)-3-(3-(trifluoromethyl)phenyl)urea CHEMBL213910
TypeSmall organic molecule
Emp. Form.C30H31F3N6OS
Mol. Mass.580.667
SMILESCN(Cc1ccc(s1)-c1[nH]nc-2c1Cc1ccc(CN3CCN(C)CC3)cc-21)C(=O)Nc1cccc(c1)C(F)(F)F