Reaction Details
TargetMitogen-activated protein kinase 10
LigandBDBM50313646
Substrate/Competitorn/a
Meas. Tech.ChEMBL_614524 (CHEMBL1111499)
IC50 26±n/a nM
Citation Morphy, R Selectively nonselective kinase inhibition: striking the right balance. J Med Chem53:1413-37 (2010) 
 
Mitogen-activated protein kinase 10
Name:Mitogen-activated protein kinase 10
Type:Enzyme
Mol. Mass.:52586.89
Organism:Homo sapiens (Human)
Description:n/a
Residue:464
BDBM50313646
NameBDBM50313646
Synonyms:CHEMBL1080582 | N-cyclohexyl-4-(3-phenyl-5-(piperidin-1-ylmethyl)isoxazol-4-yl)pyrimidin-2-amine
TypeSmall organic molecule
Emp. Form.C25H31N5O
Mol. Mass.417.5465
SMILESC(N1CCCCC1)c1onc(c1-c1ccnc(NC2CCCCC2)n1)-c1ccccc1