Reaction Details
TargetReceptor tyrosine-protein kinase erbB-2
LigandBDBM50313647
Substrate/Competitorn/a
Meas. Tech.ChEMBL_614502 (CHEMBL1111475)
IC50 81.0±n/a nM
Citation Morphy, R Selectively nonselective kinase inhibition: striking the right balance. J Med Chem53:1413-37 (2010) 
 
Receptor tyrosine-protein kinase erbB-2
Name:Receptor tyrosine-protein kinase erbB-2
Type:n/a
Mol. Mass.:137894.47
Organism:Homo sapiens (Human)
Description:P04626
Residue:1255
BDBM50313647
NameBDBM50313647
Synonyms:3-(2-(2-chlorobenzyl)-1H-benzo[d]imidazol-6-yl)-1-((1r,4r)-4-(1-(3-methoxypropyl)piperidin-4-yl)cyclohexyl)-1H-pyrazolo[3,4-d]pyrimidin-4-amine | CHEMBL2374457
TypeSmall organic molecule
Emp. Form.C34H41ClN8O
Mol. Mass.613.195
SMILESCOCCCN1CCC(CC1)[C@H]1CC[C@@H](CC1)n1nc(-c2ccc3nc(Cc4ccccc4Cl)[nH]c3c2)c2c(N)ncnc12