Reaction Details
TargetInsulin-like growth factor 1 receptor
LigandBDBM50313648
Substrate/Competitorn/a
Meas. Tech.ChEMBL_614503 (CHEMBL1111476)
IC50 81±n/a nM
Citation Morphy, R Selectively nonselective kinase inhibition: striking the right balance. J Med Chem53:1413-37 (2010) 
 
Insulin-like growth factor 1 receptor
Name:Insulin-like growth factor 1 receptor
Type:Protein
Mol. Mass.:154776.79
Organism:Homo sapiens (Human)
Description:P08069
Residue:1367
BDBM50313648
NameBDBM50313648
Synonyms:CHEMBL2374458 | trans-3-(2-(2-methoxybenzyl)-1H-benzo[d]imidazol-6-yl)-1-(4-(1-methylpiperidin-4-yl)cyclohexyl)-1H-pyrazolo[3,4-d]pyrimidin-4-amine
TypeSmall organic molecule
Emp. Form.C32H38N8O
Mol. Mass.550.6971
SMILESCOc1ccccc1Cc1nc2ccc(cc2[nH]1)-c1nn([C@H]2CC[C@@H](CC2)C2CCN(C)CC2)c2ncnc(N)c12